Reaction Details
TargetHistone deacetylase 1
LigandBDBM50229191
Substrate/Competitorn/a
Meas. Tech.Flag Assay
IC50 58±n/a nM
Citation Harrington, PHeidebrecht, Jr., RWKattar, SMiller, TAOtte, KMSiliphaivanh, PStanton, MGTempest, PWilson, KJWitter, DJ 4-carboxybenzylamino derivatives as histone deacetylase inhibitors US Patent US9096559 Publication Date 8/4/2015
 
Histone deacetylase 1
Name:Histone deacetylase 1
Type:Enzyme
Mol. Mass.:55090.27
Organism:Homo sapiens (Human)
Description:Q13547
Residue:482
BDBM50229191
NameBDBM50229191
Synonyms:CHEMBL252409 [4-(4-amino-biphenyl-3-ylcarbamoyl)-benzyl]-carbamic acid benzyl ester
TypeSmall organic molecule
Emp. Form.C28H25N3O3
Mol. Mass.451.5164
SMILESNc1ccc(cc1NC(=O)c1ccc(CNC(=O)OCc2ccccc2)cc1)-c1ccccc1