Reaction Details
TargetHistone deacetylase 1
LigandBDBM50229193
Substrate/Competitorn/a
Meas. Tech.Flag Assay
IC50 6±n/a nM
Citation Harrington, PHeidebrecht, Jr., RWKattar, SMiller, TAOtte, KMSiliphaivanh, PStanton, MGTempest, PWilson, KJWitter, DJ 4-carboxybenzylamino derivatives as histone deacetylase inhibitors US Patent US9096559 Publication Date 8/4/2015
 
Histone deacetylase 1
Name:Histone deacetylase 1
Type:Enzyme
Mol. Mass.:55090.27
Organism:Homo sapiens (Human)
Description:Q13547
Residue:482
BDBM50229193
NameBDBM50229193
Synonyms:CHEMBL400721 methyl 4-((2-amino-5-(thiophen-2-yl)phenyl)carbamoyl)benzylcarbamate
TypeSmall organic molecule
Emp. Form.C20H19N3O3S
Mol. Mass.381.448
SMILESCOC(=O)NCc1ccc(cc1)C(=O)Nc1cc(ccc1N)-c1cccs1