Reaction Details
TargetTyrosine-protein kinase SYK
LigandBDBM172947
Substrate/Competitorn/a
Meas. Tech.In Vitro Kinase Assay
IC50 0.7±n/a nM
Citation Dahmann, GDollinger, HGnamm, CFiegen, DHoffmann, MKlicic, JLamb, DJSchnapp, A Amino-indolyl-substituted imidazolyl-pyrimidines and their use as medicaments US Patent US9096579 Publication Date 8/4/2015
 
Tyrosine-protein kinase SYK
Name:Tyrosine-protein kinase SYK
Type:Enzyme
Mol. Mass.:72079.99
Organism:Homo sapiens (Human)
Description:P43405
Residue:635
BDBM172947
NameBDBM172947
Synonyms:US9096579, 49
TypeSmall organic molecule
Emp. Form.C26H27ClN8O3
Mol. Mass.534.997
SMILESCN1C(=O)COCC11CCN(CC1)C(=O)c1cc2cc(Nc3nccc(n3)-c3cn(C)cn3)cc(Cl)c2[nH]1