Reaction Details
TargetTyrosine-protein kinase SYK
LigandBDBM172902
Substrate/Competitorn/a
Meas. Tech.In Vitro Kinase Assay
IC50 0.5±n/a nM
Citation Dahmann, GDollinger, HGnamm, CFiegen, DHoffmann, MKlicic, JLamb, DJSchnapp, A Amino-indolyl-substituted imidazolyl-pyrimidines and their use as medicaments US Patent US9096579 Publication Date 8/4/2015
 
Tyrosine-protein kinase SYK
Name:Tyrosine-protein kinase SYK
Type:Enzyme
Mol. Mass.:72079.99
Organism:Homo sapiens (Human)
Description:P43405
Residue:635
BDBM172902
NameBDBM172902
Synonyms:US9096579, 4
TypeSmall organic molecule
Emp. Form.C18H17N7O
Mol. Mass.347.3739
SMILESCc1cc(Nc2nccc(n2)-c2cn(C)cn2)cc2cc([nH]c12)C(N)=O