Reaction Details
TargetTyrosine-protein kinase SYK
LigandBDBM172927
Substrate/Competitorn/a
Meas. Tech.In Vitro Kinase Assay
IC50 3.3±n/a nM
Citation Dahmann, GDollinger, HGnamm, CFiegen, DHoffmann, MKlicic, JLamb, DJSchnapp, A Amino-indolyl-substituted imidazolyl-pyrimidines and their use as medicaments US Patent US9096579 Publication Date 8/4/2015
 
Tyrosine-protein kinase SYK
Name:Tyrosine-protein kinase SYK
Type:Enzyme
Mol. Mass.:72079.99
Organism:Homo sapiens (Human)
Description:P43405
Residue:635
BDBM172927
NameBDBM172927
Synonyms:US9096579, 29
TypeSmall organic molecule
Emp. Form.C24H27ClN8O
Mol. Mass.478.977
SMILESCC(C)n1cnc(c1)-c1ccnc(Nc2cc(Cl)c3[nH]c(cc3c2)C(=O)N2CCN(C)CC2)n1