Reaction Details
TargetcAMP and cAMP-inhibited cGMP 3',5'-cyclic phosphodiesterase 10A
LigandBDBM173194
Substrate/Competitorn/a
Meas. Tech.Inhibition Assay
Temperature298.15±n/a K
IC50 0.55±n/a nM
Commentsextracted
Citation Püschl, ANielsen, JKehler, JKilburn, JPMarigo, MLanggård, M Heteroaromatic phenylimidazole derivatives as PDE10A enzyme inhibitors US Patent US9096589 Publication Date 8/4/2015
 
cAMP and cAMP-inhibited cGMP 3',5'-cyclic phosphodiesterase 10A
Name:cAMP and cAMP-inhibited cGMP 3',5'-cyclic phosphodiesterase 10A
Type:Protein
Mol. Mass.:88412.52
Organism:Homo sapiens (Human)
Description:Q9Y233
Residue:779
BDBM173194
NameBDBM173194
Synonyms:US9096589, 5,8-Dimethyl-2-[2-(1-methyl-4-pyridin-4-yl-1H-imidazol-2-yl)-ethyl]-[1,2,4]triazolo[1,5-a]pyrazine
TypeSmall organic molecule
Emp. Form.C18H19N7
Mol. Mass.333.3904
SMILESCc1cnc(C)c2nc(CCc3nc(cn3C)-c3ccncc3)nn12