Reaction Details
TargetNeuraminidase
LigandBDBM5230
Substrate/CompetitorBDBM4702
Meas. Tech.Neuraminidase Inhibition Assay
pH6.5±n/a
Temperature310.15±n/a K
IC50 90±n/a nM
Citation Lew, WWu, HMendel, DBEscarpe, PAChen, XLaver, WGGraves, BJKim, CU A new series of C3-aza carbocyclic influenza neuraminidase inhibitors: synthesis and inhibitory activity. Bioorg Med Chem Lett8:3321-4 (1998) 
 
Neuraminidase
Name:Neuraminidase
Type:Enzyme
Mol. Mass.:50124.14
Organism:Influenza A virus (A/Puerto Rico/8/34/Mount Sinai(H1N1))
Description:P03468
Residue:454
BDBM5230
BDBM4702
NameBDBM5230
Synonyms:(3R,4R,5S)-5-amino-4-acetamido-3-[ethyl(propyl)amino]cyclohex-1-ene-1-carboxylic acid | C3-Aza Carbocyclic Analogue 3f
TypeSmall organic molecule
Emp. Form.C14H25N3O3
Mol. Mass.283.3666
SMILESCCCN(CC)[C@@H]1C=C(C[C@H](N)[C@H]1NC(C)=O)C(O)=O