Reaction Details
TargetGlycogen synthase kinase-3 alpha
LigandBDBM173195
Substrate/Competitorn/a
Meas. Tech.HTS Assay
Temperature298.15±n/a K
IC50 161±n/a nM
Commentsextracted
Citation Wagner, FFPan, JQDandapani, SGermain, AHolson, EMunoz, BNag, PPWeiwer, MLewis, MCHaggarty, SJBishop, JAStegmaier, KBanerji, V Kinase inhibitors and methods of use thereof US Patent US9096594 Publication Date 8/4/2015
 
Glycogen synthase kinase-3 alpha
Name:Glycogen synthase kinase-3 alpha
Type:Enzyme
Mol. Mass.:50991.79
Organism:Homo sapiens (Human)
Description:P49840
Residue:483
BDBM173195
NameBDBM173195
Synonyms:US10137122, Compound 3 | US9096594, 3
TypeSmall organic molecule
Emp. Form.C19H21N3O
Mol. Mass.307.3895
SMILESCc1[nH]nc2NC3=C([C@H](c12)c1ccccc1)C(=O)CC(C)(C)C3