Reaction Details
TargetRibonuclease pancreatic
LigandBDBM173608
Substrate/Competitorn/a
Meas. Tech.Ribonuclease Activity Assay
Temperature303.15±n/a K
Ki 1.591e+5± 2.69e+4 nM
Commentsextracted
Citation Chatzileontiadou, DSParmenopoulou, VManta, SKantsadi, ALKylindri, PGriniezaki, MKontopoulou, FTelopoulou, AProkova, HPanagopoulos, DBoix, EBalatsos, NAKomiotis, DLeonidas, DD Triazole double-headed ribonucleosides as inhibitors of eosinophil derived neurotoxin. Bioorg Chem63:152-65 (2015) 
 
Ribonuclease pancreatic
Name:Ribonuclease pancreatic
Type:Enzyme
Mol. Mass.:16468.79
Organism:Bison bison (American bison)
Description:carboxamidomethylated RNase A
Residue:150
BDBM173608
NameBDBM173608
Synonyms:1-[3'-[4-[(Adenine-9-yl)methyl]-1,2,3-triazol-1-yl]-b-D-ribofuranosyl]uracil (5a)
TypeSmall organic molecule
Emp. Form.C17H18N10O5
Mol. Mass.442.3888
SMILESNc1ncnc2n(Cc3cn(nn3)[C@H]3[C@@H](CO)O[C@H](C3O)n3ccc(=O)[nH]c3=O)cnc12