Reaction Details
TargetRibonuclease pancreatic
LigandBDBM173614
Substrate/Competitorn/a
Meas. Tech.Ribonuclease Activity Assay
Temperature303.15±n/a K
Ki 6.88e+4± 6.8e+3 nM
Commentsextracted
Citation Chatzileontiadou, DSParmenopoulou, VManta, SKantsadi, ALKylindri, PGriniezaki, MKontopoulou, FTelopoulou, AProkova, HPanagopoulos, DBoix, EBalatsos, NAKomiotis, DLeonidas, DD Triazole double-headed ribonucleosides as inhibitors of eosinophil derived neurotoxin. Bioorg Chem63:152-65 (2015) 
 
Ribonuclease pancreatic
Name:Ribonuclease pancreatic
Type:Enzyme
Mol. Mass.:16468.79
Organism:Bison bison (American bison)
Description:carboxamidomethylated RNase A
Residue:150
BDBM173614
NameBDBM173614
Synonyms:9-[3'-[4-[(Thymine-1-yl)methyl]-1,2,3-triazol-1-yl]-b-D-ribofuranosyl]adenine (12b)
TypeSmall organic molecule
Emp. Form.C18H22N10O5
Mol. Mass.458.4313
SMILESCc1cn(Cc2cn(nn2)[C@H]2[C@@H](CO)O[C@H](C2O)N2C=NC3C2N=CN=C3N)c(=O)[nH]c1=O