Reaction Details
TargetNon-secretory ribonuclease
LigandBDBM173615
Substrate/Competitorn/a
Meas. Tech.Ribonuclease Activity Assay
Temperature303.15±n/a K
Ki 1.164e+5± 1.46e+4 nM
IC50 1.785e+5± 4.9e+3 nM
Commentsextracted
Citation Chatzileontiadou, DSParmenopoulou, VManta, SKantsadi, ALKylindri, PGriniezaki, MKontopoulou, FTelopoulou, AProkova, HPanagopoulos, DBoix, EBalatsos, NAKomiotis, DLeonidas, DD Triazole double-headed ribonucleosides as inhibitors of eosinophil derived neurotoxin. Bioorg Chem63:152-65 (2015) 
 
Non-secretory ribonuclease
Name:Non-secretory ribonuclease
Type:Protein
Mol. Mass.:18364.09
Organism:Homo sapiens (Human)
Description:n/a
Residue:161
BDBM173615
NameBDBM173615
Synonyms:1-({1-[(2R,5R)-3,4-dihydroxy-5-(hydroxymethyl)oxolan-2-yl]-1H-1,2,3-triazol-4-yl}methyl)-1,2,3,4-tetrahydropyrimidine-2,4-dione (I)
TypeSmall organic molecule
Emp. Form.C12H15N5O6
Mol. Mass.325.2774
SMILESOC[C@H]1O[C@H](C(O)[C@H]1O)n1cc(Cn2ccc(=O)[nH]c2=O)nn1