Reaction Details
TargetNon-secretory ribonuclease
LigandBDBM173617
Substrate/Competitorn/a
Meas. Tech.Ribonuclease Activity Assay
Temperature303.15±n/a K
Ki 4.42e+4± 6.9e+3 nM
IC50 6.37e+4± 5.9e+3 nM
Commentsextracted
Citation Chatzileontiadou, DSParmenopoulou, VManta, SKantsadi, ALKylindri, PGriniezaki, MKontopoulou, FTelopoulou, AProkova, HPanagopoulos, DBoix, EBalatsos, NAKomiotis, DLeonidas, DD Triazole double-headed ribonucleosides as inhibitors of eosinophil derived neurotoxin. Bioorg Chem63:152-65 (2015) 
 
Non-secretory ribonuclease
Name:Non-secretory ribonuclease
Type:Protein
Mol. Mass.:18364.09
Organism:Homo sapiens (Human)
Description:n/a
Residue:161
BDBM173617
NameBDBM173617
Synonyms:1-({1-[(2R,5R)-3,4-dihydroxy-5-(hydroxymethyl)oxolan-2-yl]-1H-1,2,3-triazol-4-yl}methyl)-5-fluoro-1,2,3,4-tetrahydropyrimidine-2,4-dione (III)
TypeSmall organic molecule
Emp. Form.C12H14FN5O6
Mol. Mass.343.2679
SMILESOC[C@H]1O[C@H](C(O)[C@H]1O)n1cc(Cn2cc(F)c(=O)[nH]c2=O)nn1