Reaction Details
TargetNon-secretory ribonuclease
LigandBDBM173620
Substrate/Competitorn/a
Meas. Tech.Ribonuclease Activity Assay
Temperature303.15±n/a K
Ki 2.083e+5± 2.68e+4 nM
IC50 2.821e+5± 4.7e+3 nM
Commentsextracted
Citation Chatzileontiadou, DSParmenopoulou, VManta, SKantsadi, ALKylindri, PGriniezaki, MKontopoulou, FTelopoulou, AProkova, HPanagopoulos, DBoix, EBalatsos, NAKomiotis, DLeonidas, DD Triazole double-headed ribonucleosides as inhibitors of eosinophil derived neurotoxin. Bioorg Chem63:152-65 (2015) 
 
Non-secretory ribonuclease
Name:Non-secretory ribonuclease
Type:Protein
Mol. Mass.:18364.09
Organism:Homo sapiens (Human)
Description:n/a
Residue:161
BDBM173620
NameBDBM173620
Synonyms:1-[(2R,5R)-3,4-dihydroxy-5-(hydroxymethyl)oxolan-2-yl]-5-fluoro-1,2,3,4-tetrahydropyrimidine-2,4-dione (VI)
TypeSmall organic molecule
Emp. Form.C9H11FN2O6
Mol. Mass.262.1918
SMILESOC[C@H]1O[C@H](C(O)[C@H]1O)n1cc(F)c(=O)[nH]c1=O