Reaction Details
TargetP2X purinoceptor 7
LigandBDBM173651
Substrate/Competitorn/a
Meas. Tech.Binding Assay
pH7.4±n/a
Temperature298.15±n/a K
IC50 0.76±n/a nM
Commentsextracted
Citation Kilburn, JPRasmussen, LKJessing, MEldemenky, EMChen, BJiang, YHopper, AT Benzamides US Patent US9102591 Publication Date 8/11/2015
 
P2X purinoceptor 7
Name:P2X purinoceptor 7
Type:Protein
Mol. Mass.:68602.85
Organism:Homo sapiens (Human)
Description:Q99572
Residue:595
BDBM173651
NameBDBM173651
Synonyms:US9102591, 2-chloro-N-[[4,4-difluoro-1-(6-fluoro-3-pyridyl)cyclohexyl]methyl]-5-methyl-benzamide | US9649308, 2-chloro-N-[[4,4-difluoro-1-(6-fluoro-3-pyridyl)cyclohexyl]methyl]-5-methyl-benzamide
TypeSmall organic molecule
Emp. Form.C20H20ClF3N2O
Mol. Mass.396.834
SMILESCc1ccc(Cl)c(c1)C(=O)NCC1(CCC(F)(F)CC1)c1ccc(F)nc1