Reaction Details
TargetP2X purinoceptor 7
LigandBDBM173675
Substrate/Competitorn/a
Meas. Tech.Binding Assay
pH7.4±n/a
Temperature298.15±n/a K
IC50 0.55±n/a nM
Commentsextracted
Citation Kilburn, JPRasmussen, LKJessing, MEldemenky, EMChen, BJiang, YHopper, AT Benzamides US Patent US9102591 Publication Date 8/11/2015
 
P2X purinoceptor 7
Name:P2X purinoceptor 7
Type:Protein
Mol. Mass.:68602.85
Organism:Homo sapiens (Human)
Description:Q99572
Residue:595
BDBM173675
NameBDBM173675
Synonyms:US9102591, (+)2,3-dichloro-N-[3-cyclopropyl-2-[6-(trifluoromethyl)-3-pyridyl]propyl]benzamide US9102591, 2,3-dichloro-N-[3-cyclopropyl-2-[6-(trifluoromethyl)-3-pyridyl]propyl]benzamide | US9649308, (-)2,3-dichloro-N-[3-cyclopropyl-2-[6-(trifluoromethyl)-3-pyridyl]propyl]benzamide
TypeSmall organic molecule
Emp. Form.C19H17Cl2F3N2O
Mol. Mass.417.252
SMILESFC(F)(F)c1ccc(cn1)C(CNC(=O)c1cccc(Cl)c1Cl)CC1CC1