Reaction Details
TargetP2X purinoceptor 7
LigandBDBM173694
Substrate/Competitorn/a
Meas. Tech.Binding Assay
pH7.4±n/a
Temperature298.15±n/a K
IC50 0.76±n/a nM
Commentsextracted
Citation Kilburn, JPRasmussen, LKJessing, MEldemenky, EMChen, BJiang, YHopper, AT Benzamides US Patent US9102591 Publication Date 8/11/2015
 
P2X purinoceptor 7
Name:P2X purinoceptor 7
Type:Protein
Mol. Mass.:68602.85
Organism:Homo sapiens (Human)
Description:Q99572
Residue:595
BDBM173694
NameBDBM173694
Synonyms:US9102591, 2,3-dichloro-N-[2-(6-cyclopropyl-3-pyridyl)-3-[1-(difluoromethyl)cyclopropyl]propyl]benzamide | US9649308, 2,3-dichloro-N-[2-(6-cyclopropyl-3-pyridyl)-3-[1-(difluoromethyl)cyclopropyl]propyl]benzamide
TypeSmall organic molecule
Emp. Form.C22H22Cl2F2N2O
Mol. Mass.439.326
SMILESFC(F)C1(CC(CNC(=O)c2cccc(Cl)c2Cl)c2ccc(nc2)C2CC2)CC1