Reaction Details
TargetRho-associated protein kinase 1/2
LigandBDBM148416
Substrate/Competitorn/a
Meas. Tech.MLC Phosphorylation Assay
EC50<100±n/a nM
Citation Boland, SBourin, ADefert, OLeysen, D Pyridine derivatives as soft rock inhibitors US Patent US9682963 Publication Date 6/20/2017
 
Rho-associated protein kinase 1/2
Name:Rho-associated protein kinase 1/2
Synonyms:ROCK Complex
Type:Protein
Mol. Mass.:n/a
Description:n/a
Components:This complex has 2 components.
Component 1
Name:Rho-associated protein kinase 1
Type:Protein
Mol. Mass.:159610.34
Organism:Rattus norvegicus (Rat)
Description:Q63644
Residue:1369
Component 2
Name:Rho-associated protein kinase 2
Synonyms:ROCK2_RAT Rho-associated protein kinase 2 Rho-associated, coiled-coil-containing protein kinase 2 RhoA-binding kinase 2 p150 ROK-alpha
Type:Protein
Mol. Mass.:160370.90
Organism:Rattus norvegicus (Rat)
Description:Q62868
Residue:1388
BDBM148416
NameBDBM148416
Synonyms:US9682963, 9
TypeSmall organic molecule
Emp. Form.C31H27FN4O4S
Mol. Mass.570.634
SMILESCC1CC(Sc2ccc(NC(=O)c3cccc(c3)-c3cc(ccc3CN)C(=O)Nc3ccncc3F)cc2)C(=O)O1