Reaction Details
TargetNeuraminidase
LigandBDBM5258
Substrate/CompetitorBDBM4702
Meas. Tech.Neuraminidase Inhibition Assay
pH6.5±n/a
Temperature310.15±n/a K
IC50 1900±n/a nM
Citation Lew, WWu, HChen, XGraves, BJEscarpe, PAMacArthur, HLMendel, DBKim, CU Carbocyclic influenza neuraminidase inhibitors possessing a C3-cyclic amine side chain: synthesis and inhibitory activity. Bioorg Med Chem Lett10:1257-60 (2000) 
 
Neuraminidase
Name:Neuraminidase
Type:Enzyme
Mol. Mass.:50124.14
Organism:Influenza A virus (A/Puerto Rico/8/34/Mount Sinai(H1N1))
Description:P03468
Residue:454
BDBM5258
BDBM4702
NameBDBM5258
Synonyms:(3R,4R,5S)-5-amino-4-acetamido-3-(4-methylpiperazin-1-yl)cyclohex-1-ene-1-carboxylic acid | C3-Cyclic Amine Carbocyclic Analogue 4i
TypeSmall organic molecule
Emp. Form.C14H24N4O3
Mol. Mass.296.3654
SMILESCN1CCN(CC1)[C@@H]1C=C(C[C@H](N)[C@H]1NC(C)=O)C(O)=O