Reaction Details
TargetMAP kinase-activated protein kinase 2
LigandBDBM175242
Substrate/Competitorn/a
Meas. Tech.IMAP Assay
pH7.5±n/a
IC50 21±n/a nM
Commentsextracted
Citation Hockerman, SLMonahan, JBSelness, SR Methyl/fluoro-pyridinyl-methoxy substituted pyridinone-pyridinyl compounds and fluoro-pyrimidinyl-methoxy substituted pyridinone-pyridinyl compounds US Patent US9115089 Publication Date 8/25/2015
 
MAP kinase-activated protein kinase 2
Name:MAP kinase-activated protein kinase 2
Type:Serine/threonine-protein kinase
Mol. Mass.:45579.87
Organism:Homo sapiens (Human)
Description:P49137
Residue:400
BDBM175242
NameBDBM175242
Synonyms:US11844801, Compound (M)-I | US9115089, 49
TypeSmall organic molecule
Emp. Form.C25H22ClF2N5O3
Mol. Mass.513.924
SMILESCc1cnc(cc1-n1c(C)cc(OCc2ncc(F)cc2F)c(Cl)c1=O)-c1ccnc(n1)C(C)(C)O