Reaction Details
TargetHistone deacetylase 1
LigandBDBM19149
Substrate/Competitorn/a
Meas. Tech.Fluorescent Activity Assay
Temperature298.15±n/a K
IC50 20.9±7.1 nM
Commentsextracted
Citation Lin, JChen, CFang, JChen, JChern, TWei, T Dual action inhibitors against histone deacetylases and 3-hydroxy-3-methylglutaryl coenzyme a reductase US Patent US9115116 Publication Date 8/25/2015
 
Histone deacetylase 1
Name:Histone deacetylase 1
Type:Enzyme
Mol. Mass.:55090.27
Organism:Homo sapiens (Human)
Description:Q13547
Residue:482
BDBM19149
NameBDBM19149
Synonyms:CHEMBL98 SAHA US10188756, Compound SAHA US11505523, Compound SAHA US9353061, SAHA US9695181, Vorinostat Zolinza suberoylanilide hydroxamic acid
TypeSmall organic molecule
Emp. Form.C14H20N2O3
Mol. Mass.264.3202
SMILESONC(=O)CCCCCCC(=O)Nc1ccccc1