Reaction Details
TargetAcetylcholinesterase
LigandBDBM11023
Substrate/Competitorn/a
Meas. Tech.Acetylcholinesterase Assay
pH7.7±n/a
IC50 4e+1± 0.1 nM
Commentsextracted
Citation Mutahir, SJonczyk, JBajda, MKhan, IUKhan, MAUllah, NAshraf, MQurat-Ul-Ain, nullRiaz, SHussain, SYar, M Novel biphenyl bis-sulfonamides as acetyl and butyrylcholinesterase inhibitors: Synthesis, biological evaluation and molecular modeling studies. Bioorg Chem64:13-20 (2016) 
 
Acetylcholinesterase
Name:Acetylcholinesterase
Type:Enzyme
Mol. Mass.:67792.70
Organism:Homo sapiens (Human)
Description:P22303
Residue:614
BDBM11023
NameBDBM11023
Synonyms:(3aS,8aR)-1,3a,8-trimethyl-1H,2H,3H,3aH,8H,8aH-pyrrolo[2,3-b]indol-5-yl N-methylcarbamate; 2-hydroxybenzoic acid cid_657348 | physostigmine.salicylic acid
TypeSmall Organic Molecule
Emp. Form.C15H21N3O2
Mol. Mass.275.3461
SMILES[H][C@]12N(C)CC[C@@]1(C)c1cc(OC(=O)NC)ccc1N2C