Reaction Details
TargetProtein Nef
LigandBDBM288032
Substrate/Competitorn/a
Meas. Tech.Measurement of Antiviral (HIV-1) Activity
Temperature298.15±n/a K
EC50 5.40±n/a nM
Commentsextracted
Citation Miyazaki, SIsoshima, HOshita, KKawashita, SNagahashi, NTerashita, M Substituted spiropyrido[1,2-a]pyrazine derivative and medicinal use thereof as HIV integrase inhibitor US Patent US10087178 Publication Date 10/2/2018
 
Protein Nef
Name:Protein Nef
Type:C-terminal core protein
Mol. Mass.:23340.47
Organism:Human immunodeficiency virus type 1 (isolate BRU/LAI group M subtype B)
Description:P03406
Residue:206
BDBM288032
NameBDBM288032
Synonyms:US10087178, Example 13
TypeSmall organic molecule
Emp. Form.C22H23F2N3O5
Mol. Mass.447.4319
SMILESCC(C)N1C[C@]2(C[C@@H]2CO)n2cc(C(=O)NCc3ccc(F)cc3F)c(=O)c(O)c2C1=O