Reaction Details
TargetProtein Nef
LigandBDBM288045
Substrate/Competitorn/a
Meas. Tech.Measurement of Antiviral (HIV-1) Activity
Temperature298.15±n/a K
EC50 4.40±n/a nM
Commentsextracted
Citation Miyazaki, SIsoshima, HOshita, KKawashita, SNagahashi, NTerashita, M Substituted spiropyrido[1,2-a]pyrazine derivative and medicinal use thereof as HIV integrase inhibitor US Patent US10087178 Publication Date 10/2/2018
 
Protein Nef
Name:Protein Nef
Type:C-terminal core protein
Mol. Mass.:23340.47
Organism:Human immunodeficiency virus type 1 (isolate BRU/LAI group M subtype B)
Description:P03406
Residue:206
BDBM288045
NameBDBM288045
Synonyms:N-(2,4-difluorobenzyl)-9'- hydroxy-2'-isopropyl-trans- 3-methoxy-1',8'-dioxo- 1',2',3',8'- tetrahydrospiro[cyclobutane- 1,4'-pyrido[1,2-a]pyrazine]- 7'-carboxamide hydrochloride | US10087178, Example S5
TypeSmall organic molecule
Emp. Form.C23H25F2N3O5
Mol. Mass.461.4585
SMILESCO[C@H]1C[C@]2(C1)CN(C(C)C)C(=O)c1c(O)c(=O)c(cn21)C(=O)NCc1ccc(F)cc1F