Reaction Details
TargetAldehyde oxidase 1
LigandBDBM24778
Substrate/Competitorn/a
Meas. Tech.AO Enzyme Assay
pH7±n/a
Ki 7.23e+3± 6.4e+2 nM
IC50 3.18e+4±n/a nM
Commentsextracted
Citation Siah, MFarzaei, MHAshrafi-Kooshk, MRAdibi, HArab, SSRashidi, MRKhodarahmi, R Inhibition of guinea pig aldehyde oxidase activity by different flavonoid compounds: An in vitro study. Bioorg Chem64:74-84 (2016) 
 
Aldehyde oxidase 1
Name:Aldehyde oxidase 1
Type:Protein
Mol. Mass.:145280.02
Organism:Cavia porcellus (Guinea pig)
Description:H9TB17
Residue:1332
BDBM24778
NameBDBM24778
Synonyms:2-methyl-1,4-dihydronaphthalene-1,4-dione CHEMBL590 Menadione (5d) Menadione, 9 cid_4055
TypeSmall organic molecule
Emp. Form.C11H8O2
Mol. Mass.172.18
SMILESCC1=CC(=O)c2ccccc2C1=O