Reaction Details
TargetCannabinoid receptor 2
LigandBDBM176612
Substrate/Competitorn/a
Meas. Tech.Binding Assay
IC50 11±n/a nM
Citation Arnaud, JArtiaga, MBarth, FHortala, LMartinez, SRoux, P 1,3,5-triazine-2-amine derivatives, preparation thereof and diagnostic and therapeutic use thereof US Patent US9115121 Publication Date 8/25/2015
 
Cannabinoid receptor 2
Name:Cannabinoid receptor 2
Type:G Protein-Coupled Receptor (GPCR)
Mol. Mass.:39690.94
Organism:Homo sapiens (Human)
Description:P34972
Residue:360
BDBM176612
NameBDBM176612
Synonyms:US9115121, 3
TypeSmall organic molecule
Emp. Form.C20H21FN4O3
Mol. Mass.384.4041
SMILESCOc1ccc(cc1OC)-c1nc(NCCc2ccc(F)cc2)nc(OC)n1