Reaction Details
TargetPlasminogen activator inhibitor 1
LigandBDBM175525
Substrate/Competitorn/a
Meas. Tech.Fluorometric Plate Assay
pH7.8±n/a
Temperature296.15±n/a K
IC50 10±n/a nM
Commentsextracted
Citation Lawrence, DAEmal, CCale, JSu, EJWarnock, MLi, SCupp, JA Plasminogen activator inhibitor-1 inhibitors and methods of use thereof to modulate lipid metabolism US Patent US9120744 Publication Date 9/1/2015
 
Plasminogen activator inhibitor 1
Name:Plasminogen activator inhibitor 1
Type:Enzyme
Mol. Mass.:45064.00
Organism:Homo sapiens (Human)
Description:P05121
Residue:402
BDBM175525
NameBDBM175525
Synonyms:US9120744, CDE-001 (or 073)
TypeSmall organic molecule
Emp. Form.C41H32O26
Mol. Mass.940.6772
SMILESOc1cc(cc(O)c1O)C(=O)OC[C@H]1OC(OC(=O)c2cc(O)c(O)c(O)c2)[C@H](OC(=O)c2cc(O)c(O)c(O)c2)[C@@H](OC(=O)c2cc(O)c(O)c(O)c2)[C@@H]1OC(=O)c1cc(O)c(O)c(O)c1