Reaction Details
TargetMaternal embryonic leucine zipper kinase
LigandBDBM177235
Substrate/Competitorn/a
Meas. Tech.Kinase Assay
pH7.4±n/a
Temperature298.15±n/a K
IC50 1.1±n/a nM
Commentsextracted
Citation Matsuo, YHisada, SNakamura, YAhmed, FHuntley, RWalker, JRDecornez, H Quinoline derivatives and MELK inhibitors containing the same US Patent US9120749 Publication Date 9/1/2015
 
Maternal embryonic leucine zipper kinase
Name:Maternal embryonic leucine zipper kinase
Type:Enzyme
Mol. Mass.:74665.45
Organism:Homo sapiens (Human)
Description:Q14680
Residue:651
BDBM177235
NameBDBM177235
Synonyms:US9120749, 601 | US9120749, 602
TypeSmall organic molecule
Emp. Form.C28H25Cl2N3O2
Mol. Mass.506.423
SMILESCC(C)(N)c1ccc(Nc2c(cnc3ccc(cc23)-c2cc(Cl)c(O)c(Cl)c2)C(=O)C2CC2)cc1