Reaction Details
TargetMaternal embryonic leucine zipper kinase
LigandBDBM177285
Substrate/Competitorn/a
Meas. Tech.Kinase Assay
pH7.4±n/a
Temperature298.15±n/a K
IC50 0.76±n/a nM
Commentsextracted
Citation Matsuo, YHisada, SNakamura, YAhmed, FHuntley, RWalker, JRDecornez, H Quinoline derivatives and MELK inhibitors containing the same US Patent US9120749 Publication Date 9/1/2015
 
Maternal embryonic leucine zipper kinase
Name:Maternal embryonic leucine zipper kinase
Type:Enzyme
Mol. Mass.:74665.45
Organism:Homo sapiens (Human)
Description:Q14680
Residue:651
BDBM177285
NameBDBM177285
Synonyms:US9120749, 651
TypeSmall organic molecule
Emp. Form.C29H27ClFN5O2
Mol. Mass.532.008
SMILESN[C@@H]1CCCN(C1)c1ccc(Nc2c(cnc3ccc(cc23)-c2cc(F)c(O)c(Cl)c2)C(=O)C2CC2)cn1