Reaction Details
TargetMaternal embryonic leucine zipper kinase
LigandBDBM177426
Substrate/Competitorn/a
Meas. Tech.Kinase Assay
pH7.4±n/a
Temperature298.15±n/a K
IC50 1.1±n/a nM
Commentsextracted
Citation Matsuo, YHisada, SNakamura, YAhmed, FHuntley, RWalker, JRDecornez, H Quinoline derivatives and MELK inhibitors containing the same US Patent US9120749 Publication Date 9/1/2015
 
Maternal embryonic leucine zipper kinase
Name:Maternal embryonic leucine zipper kinase
Type:Enzyme
Mol. Mass.:74665.45
Organism:Homo sapiens (Human)
Description:Q14680
Residue:651
BDBM177426
NameBDBM177426
Synonyms:US9120749, 792
TypeSmall organic molecule
Emp. Form.C29H33Cl2N3O3
Mol. Mass.542.497
SMILESCC(=O)c1cnc2ccc(cc2c1N[C@H]1CC[C@H](CN2CCC[C@H]2CO)CC1)-c1cc(Cl)c(O)c(Cl)c1