Reaction Details
TargetTransient receptor potential cation channel subfamily V member 1
LigandBDBM176549
Substrate/Competitorn/a
Meas. Tech.FLIPR Assay
Ki 0.35±n/a nM
Citation Frank, RBahrenberg, GChristoph, TSchiene, KDe Vry, JDamann, NFrormann, SLesch, BLee, JKim, YKim, MSaunders, DStockhausen, H Substituted phenylureas and phenylamides as vanilloid receptor ligands US Patent US9120756 Publication Date 9/1/2015
 
Transient receptor potential cation channel subfamily V member 1
Name:Transient receptor potential cation channel subfamily V member 1
Type:Transient Receptor
Mol. Mass.:94956.12
Organism:Rattus norvegicus (rat)
Description:O35433
Residue:838
BDBM176549
NameBDBM176549
Synonyms:US9120756, 7
TypeSmall organic molecule
Emp. Form.C24H35FN4O3S
Mol. Mass.478.623
SMILESCC(C(=O)NCc1cc(nn1C1CCCCC1)C(C)(C)C)c1ccc(NS(C)(=O)=O)c(F)c1