Reaction Details
TargetTransient receptor potential cation channel subfamily V member 1
LigandBDBM176564
Substrate/Competitorn/a
Meas. Tech.FLIPR Assay
Ki 0.1±n/a nM
Citation Frank, RBahrenberg, GChristoph, TSchiene, KDe Vry, JDamann, NFrormann, SLesch, BLee, JKim, YKim, MSaunders, DStockhausen, H Substituted phenylureas and phenylamides as vanilloid receptor ligands US Patent US9120756 Publication Date 9/1/2015
 
Transient receptor potential cation channel subfamily V member 1
Name:Transient receptor potential cation channel subfamily V member 1
Type:Transient Receptor
Mol. Mass.:94956.12
Organism:Rattus norvegicus (rat)
Description:O35433
Residue:838
BDBM176564
NameBDBM176564
Synonyms:US9120756, 26
TypeSmall organic molecule
Emp. Form.C21H19ClF4N4O3S
Mol. Mass.518.912
SMILESC[C@H](C(=O)NCc1cc(nn1-c1cccc(Cl)c1)C(F)(F)F)c1ccc(NS(C)(=O)=O)c(F)c1