Reaction Details
TargetTransient receptor potential cation channel subfamily V member 1
LigandBDBM176555
Substrate/Competitorn/a
Meas. Tech.FLIPR Assay
Temperature310.15±n/a K
Ki 0.1±n/a nM
Commentsextracted
Citation Frank, RBahrenberg, GChristoph, TSchiene, KDe Vry, JDamann, NFrormann, SLesch, BLee, JKim, YKim, MSaunders, DStockhausen, H Substituted phenylureas and phenylamides as vanilloid receptor ligands US Patent US9120756 Publication Date 9/1/2015
 
Transient receptor potential cation channel subfamily V member 1
Name:Transient receptor potential cation channel subfamily V member 1
Type:Protein
Mol. Mass.:94960.75
Organism:Homo sapiens (Human)
Description:Q8NER1
Residue:839
BDBM176555
NameBDBM176555
Synonyms:US9120756, 17
TypeSmall organic molecule
Emp. Form.C24H28ClFN4O3S
Mol. Mass.507.021
SMILESC[C@H](C(=O)NCc1cc(nn1-c1cccc(Cl)c1)C(C)(C)C)c1ccc(NS(C)(=O)=O)c(F)c1