Reaction Details
TargetVascular endothelial growth factor receptor 3 [818-948,1003-1077]
LigandBDBM176593
Substrate/Competitorn/a
Meas. Tech.Biochemical Assay
pH7.4±n/a
IC50 13260±n/a nM
Commentsextracted
Citation Holmes, IPBergman, YLunniss, GENikac, MChol, NHemley, CFWalker, SRFoitzik, RCGaname, DLessene, R Selective FAK inhibitors US Patent US9120761 Publication Date 9/1/2015
 
Vascular endothelial growth factor receptor 3 [818-948,1003-1077]
Name:Vascular endothelial growth factor receptor 3 [818-948,1003-1077]
Type:n/a
Mol. Mass.:34324.27
Organism:Homo sapiens (Human)
Description:P35916[818-948,1003-1077]
Residue:306
BDBM176593
NameBDBM176593
Synonyms:US9120761, 7
TypeSmall organic molecule
Emp. Form.C27H30F3N5O2
Mol. Mass.513.5546
SMILESCCN1CCC(CC1)c1ccc(Nc2ncc(c(Cc3ccccc3C(N)=O)n2)C(F)(F)F)c(OC)c1