Reaction Details
TargetApoptosis regulator Bcl-2
LigandBDBM177823
Substrate/Competitorn/a
Meas. Tech.Fluorescence Polarisation Assay
pH7.4±n/a
IC50 13±n/a nM
Commentsextracted
Citation Le Diguarher, TCasara, PStarck, JHenlin, JDavidson, JEMurray, JBGraham, CJChen, IGeneste, OHickman, JDepil, SLe Tiran, ANyerges, MDe Nanteuil, G Indolizine compounds, a process for their preparation and pharmaceutical compositions containing them US Patent US9120791 Publication Date 9/1/2015
 
Apoptosis regulator Bcl-2
Name:Apoptosis regulator Bcl-2
Type:Protein
Mol. Mass.:26409.44
Organism:Mus musculus (Mouse)
Description:P10417
Residue:236
BDBM177823
NameBDBM177823
Synonyms:US9120791, Example 42 | US9603854, 42
TypeSmall organic molecule
Emp. Form.C44H43ClN6O4
Mol. Mass.755.303
SMILESCn1ncc2cc(ccc12)N(C(=O)c1cc(-c2cc(Cl)ccc2C(=O)N2Cc3ccccc3C[C@H]2CN2CCOCC2)n2CCCCc12)c1ccc(O)cc1