Reaction Details
TargetApoptosis regulator Bcl-2
LigandBDBM177869
Substrate/Competitorn/a
Meas. Tech.Fluorescence Polarisation Assay
pH7.4±n/a
IC50 6±n/a nM
Commentsextracted
Citation Le Diguarher, TCasara, PStarck, JHenlin, JDavidson, JEMurray, JBGraham, CJChen, IGeneste, OHickman, JDepil, SLe Tiran, ANyerges, MDe Nanteuil, G Indolizine compounds, a process for their preparation and pharmaceutical compositions containing them US Patent US9120791 Publication Date 9/1/2015
 
Apoptosis regulator Bcl-2
Name:Apoptosis regulator Bcl-2
Type:Protein
Mol. Mass.:26409.44
Organism:Mus musculus (Mouse)
Description:P10417
Residue:236
BDBM177869
NameBDBM177869
Synonyms:US9120791, Example 95 | US9603854, 95
TypeSmall organic molecule
Emp. Form.C46H47N5O4
Mol. Mass.733.8965
SMILESCc1ccc(C(=O)N2Cc3ccccc3C[C@H]2CN2CCOCC2)c(c1)-c1cc(C(=O)N(c2ccc(O)cc2)c2ccc3n(C)ccc3c2)c2CCCCn12