Reaction Details
TargetOpioid growth factor receptor-like protein 1
LigandBDBM177934
Substrate/Competitorn/a
Meas. Tech.Binding Assay
pH7.4±n/a
Temperature298.15±n/a K
Ki 1.1±n/a nM
Commentsextracted
Citation Hinze, CAulenbacher, OSundermann, BOberboersch, SFriderichs, EEnglberger, WKoegel, BLinz, KSchick, HSonnenschein, HHenkel, BRose, VSLipkin, MJ Process for preparing spirocyclic cyclohexane compounds, compositions containing such compounds and method of using such compounds US Patent US9120797 Publication Date 9/1/2015
 
Opioid growth factor receptor-like protein 1
Name:Opioid growth factor receptor-like protein 1
Type:Protein
Mol. Mass.:51247.53
Organism:Homo sapiens (Human)
Description:Q5TC84
Residue:451
BDBM177934
NameBDBM177934
Synonyms:US9120797, 32
TypeSmall organic molecule
Emp. Form.C26H30FN3O
Mol. Mass.419.5343
SMILESCN(C)C1(CCC2(CC1)N(CCc1c2[nH]c2cc(F)ccc12)C(C)=O)c1ccccc1