Reaction Details
TargetMu-type opioid receptor
LigandBDBM177935
Substrate/Competitorn/a
Meas. Tech.Binding Assay
Temperature298.15±n/a K
Ki 0.5±n/a nM
Commentsextracted
Citation Hinze, CAulenbacher, OSundermann, BOberboersch, SFriderichs, EEnglberger, WKoegel, BLinz, KSchick, HSonnenschein, HHenkel, BRose, VSLipkin, MJ Process for preparing spirocyclic cyclohexane compounds, compositions containing such compounds and method of using such compounds US Patent US9120797 Publication Date 9/1/2015
 
Mu-type opioid receptor
Name:Mu-type opioid receptor
Type:G Protein-Coupled Receptor (GPCR)
Mol. Mass.:44789.51
Organism:Homo sapiens (Human)
Description:P35372
Residue:400
BDBM177935
NameBDBM177935
Synonyms:US9120797, 33
TypeSmall organic molecule
Emp. Form.C25H31N3
Mol. Mass.373.5337
SMILESCC1Cc2c([nH]c3ccccc23)C2(CCC(CC2)(N(C)C)c2ccccc2)N1