Reaction Details
TargetP2Y purinoceptor 1
LigandBDBM50015292
Substrate/Competitorn/a
Meas. Tech.Scintillation Proximity Assay (SPA) Assay
pH7.4±n/a
Temperature298.15±n/a K
IC50 28±n/a nM
Commentsextracted
Citation Qiao, JXHu, CHThibeault, C Amino-heteroaryl 7-hydroxy-spiropiperidine indolinyl antagonists of P2Y1 receptor US Patent US9120798 Publication Date 9/1/2015
 
P2Y purinoceptor 1
Name:P2Y purinoceptor 1
Type:Enzyme
Mol. Mass.:42090.25
Organism:Homo sapiens (Human)
Description:P47900
Residue:373
BDBM50015292
NameBDBM50015292
Synonyms:CHEMBL3263072 | US9120798, 19
TypeSmall organic molecule
Emp. Form.C31H33Cl2N5OS
Mol. Mass.594.598
SMILESCC(C)(C)CN1CCC2(CN(c3c2c(Cl)ccc3O)c2ccccc2Nc2nnc(s2)-c2ccccc2Cl)CC1