Reaction Details
TargetP2Y purinoceptor 1
LigandBDBM50015291
Substrate/Competitorn/a
Meas. Tech.Scintillation Proximity Assay (SPA) Assay
pH7.4±n/a
Temperature298.15±n/a K
IC50 13±n/a nM
Commentsextracted
Citation Qiao, JXHu, CHThibeault, C Amino-heteroaryl 7-hydroxy-spiropiperidine indolinyl antagonists of P2Y1 receptor US Patent US9120798 Publication Date 9/1/2015
 
P2Y purinoceptor 1
Name:P2Y purinoceptor 1
Type:Enzyme
Mol. Mass.:42090.25
Organism:Homo sapiens (Human)
Description:P47900
Residue:373
BDBM50015291
NameBDBM50015291
Synonyms:CHEMBL3263071 | US9120798, 26
TypeSmall organic molecule
Emp. Form.C32H33ClF3N5O2S
Mol. Mass.644.15
SMILESCC(C)(C)CN1CCC2(CN(c3c2c(Cl)ccc3O)c2ccccc2Nc2nnc(s2)-c2ccc(OC(F)(F)F)cc2)CC1