Reaction Details
TargetP2Y purinoceptor 1
LigandBDBM50015290
Substrate/Competitorn/a
Meas. Tech.Scintillation Proximity Assay (SPA) Assay
pH7.4±n/a
Temperature298.15±n/a K
IC50 5±n/a nM
Commentsextracted
Citation Qiao, JXHu, CHThibeault, C Amino-heteroaryl 7-hydroxy-spiropiperidine indolinyl antagonists of P2Y1 receptor US Patent US9120798 Publication Date 9/1/2015
 
P2Y purinoceptor 1
Name:P2Y purinoceptor 1
Type:Enzyme
Mol. Mass.:42090.25
Organism:Homo sapiens (Human)
Description:P47900
Residue:373
BDBM50015290
NameBDBM50015290
Synonyms:CHEMBL3263070 | US9120798, 30
TypeSmall organic molecule
Emp. Form.C32H33F4N5O2S
Mol. Mass.627.695
SMILESCC(C)(C)CN1CCC2(CN(c3c2c(F)ccc3O)c2ccccc2Nc2nnc(s2)-c2ccc(OC(F)(F)F)cc2)CC1