Reaction Details
TargetOligo-1,6-glucosidase IMA1
LigandBDBM178004
Substrate/Competitorn/a
Meas. Tech.alpha-Glucosidase Inhibition Assay
pH6.8±n/a
IC50 1.26e+3± 1e+1 nM
Commentsextracted
Citation Imran, STaha, MIsmail, NHKashif, SMRahim, FJamil, WWahab, HKhan, KM Synthesis, In vitro and Docking Studies of New Flavone Ethers as a-Glucosidase Inhibitors. Chem Biol Drug Des87:361-73 (2016) 
 
Oligo-1,6-glucosidase IMA1
Name:Oligo-1,6-glucosidase IMA1
Type:Protein
Mol. Mass.:68577.59
Organism:Saccharomyces cerevisiae S288c (Baker's yeast)
Description:n/a
Residue:589
BDBM178004
NameBDBM178004
Synonyms:2-(3-((3-(trifluoromethyl)benzyl)oxy)phenyl)-4H-chromen-4-one (5) | BDBM178006
TypeSmall organic molecule
Emp. Form.C24H14F6O3
Mol. Mass.464.3566
SMILESFC(F)(F)c1ccc(c(COc2cccc(c2)-c2cc(=O)c3ccccc3o2)c1)C(F)(F)F