Reaction Details
TargetOligo-1,6-glucosidase IMA1
LigandBDBM178010
Substrate/Competitorn/a
Meas. Tech.alpha-Glucosidase Inhibition Assay
pH6.8±n/a
IC50 3.49e+3± 5e+1 nM
Commentsextracted
Citation Imran, STaha, MIsmail, NHKashif, SMRahim, FJamil, WWahab, HKhan, KM Synthesis, In vitro and Docking Studies of New Flavone Ethers as a-Glucosidase Inhibitors. Chem Biol Drug Des87:361-73 (2016) 
 
Oligo-1,6-glucosidase IMA1
Name:Oligo-1,6-glucosidase IMA1
Type:Protein
Mol. Mass.:68577.59
Organism:Saccharomyces cerevisiae S288c (Baker's yeast)
Description:n/a
Residue:589
BDBM178010
NameBDBM178010
Synonyms:2-(3-((2,3-difluorobenzyl)oxy)phenyl)-4H-chromen-4-one (13)
TypeSmall organic molecule
Emp. Form.C22H14F2O3
Mol. Mass.364.3416
SMILESFc1cccc(COc2cccc(c2)-c2cc(=O)c3ccccc3o2)c1F