Reaction Details
TargetCarbonic anhydrase 1
LigandBDBM178055
Substrate/Competitorn/a
Meas. Tech.CA I and II Esterase Assay
Ki 573.18±69.49 nM
IC50 853.97±0.0 nM
Citation Artunç, TÇetinkaya, YGöçer, HGülçin, Ä°Menzek, ASahin, ESupuran, CT Synthesis of 4-[2-(3,4-dimethoxybenzyl)cyclopentyl]-1,2-dimethoxybenzene Derivatives and Evaluations of Their Carbonic Anhydrase Isoenzymes Inhibitory Effects. Chem Biol Drug Des87:594-607 (2016) 
 
Carbonic anhydrase 1
Name:Carbonic anhydrase 1
Type:Enzyme
Mol. Mass.:28873.37
Organism:Homo sapiens (Human)
Description:P00915
Residue:261
BDBM178055
NameBDBM178055
Synonyms:[2-(4,5-dimethoxy-2-nitrophenyl)cyclopent-1-en-1-yl](3,4-dimethoxyphenyl)methanone (19)
TypeSmall organic molecule
Emp. Form.C22H23NO7
Mol. Mass.413.4205
SMILESCOc1ccc(cc1OC)C(=O)C1=C(CCC1)c1cc(OC)c(OC)cc1[N+]([O-])=O