Reaction Details
TargetCarbonic anhydrase 2
LigandBDBM178047
Substrate/Competitorn/a
Meas. Tech.CA I and II Esterase Assay
Ki 1261.45±73.22 nM
IC50 543.11±0.0 nM
Citation Artunç, TÇetinkaya, YGöçer, HGülçin, Ä°Menzek, ASahin, ESupuran, CT Synthesis of 4-[2-(3,4-dimethoxybenzyl)cyclopentyl]-1,2-dimethoxybenzene Derivatives and Evaluations of Their Carbonic Anhydrase Isoenzymes Inhibitory Effects. Chem Biol Drug Des87:594-607 (2016) 
 
Carbonic anhydrase 2
Name:Carbonic anhydrase 2
Type:Enzyme
Mol. Mass.:29250.71
Organism:Homo sapiens (Human)
Description:P00918
Residue:260
BDBM178047
NameBDBM178047
Synonyms:1,6-bis(4,5-dimethoxy-2-nitrophenyl)hexane-1,6-dione (10)
TypeSmall organic molecule
Emp. Form.C22H24N2O10
Mol. Mass.476.4334
SMILESCOc1cc(C(=O)CCCCC(=O)c2cc(OC)c(OC)cc2[N+]([O-])=O)c(cc1OC)[N+]([O-])=O