Reaction Details
TargetCarbonic anhydrase 2
LigandBDBM178055
Substrate/Competitorn/a
Meas. Tech.CA I and II Esterase Assay
Ki 1575.79±89.24 nM
IC50 577.50±0.0 nM
Citation Artunç, TÇetinkaya, YGöçer, HGülçin, Ä°Menzek, ASahin, ESupuran, CT Synthesis of 4-[2-(3,4-dimethoxybenzyl)cyclopentyl]-1,2-dimethoxybenzene Derivatives and Evaluations of Their Carbonic Anhydrase Isoenzymes Inhibitory Effects. Chem Biol Drug Des87:594-607 (2016) 
 
Carbonic anhydrase 2
Name:Carbonic anhydrase 2
Type:Enzyme
Mol. Mass.:29250.71
Organism:Homo sapiens (Human)
Description:P00918
Residue:260
BDBM178055
NameBDBM178055
Synonyms:[2-(4,5-dimethoxy-2-nitrophenyl)cyclopent-1-en-1-yl](3,4-dimethoxyphenyl)methanone (19)
TypeSmall organic molecule
Emp. Form.C22H23NO7
Mol. Mass.413.4205
SMILESCOc1ccc(cc1OC)C(=O)C1=C(CCC1)c1cc(OC)c(OC)cc1[N+]([O-])=O