Reaction Details
TargetCarbonic anhydrase 2
LigandBDBM178056
Substrate/Competitorn/a
Meas. Tech.CA I and II Esterase Assay
Ki 509.76±44.02 nM
IC50 474.98±0.0 nM
Citation Artunç, TÇetinkaya, YGöçer, HGülçin, Ä°Menzek, ASahin, ESupuran, CT Synthesis of 4-[2-(3,4-dimethoxybenzyl)cyclopentyl]-1,2-dimethoxybenzene Derivatives and Evaluations of Their Carbonic Anhydrase Isoenzymes Inhibitory Effects. Chem Biol Drug Des87:594-607 (2016) 
 
Carbonic anhydrase 2
Name:Carbonic anhydrase 2
Type:Enzyme
Mol. Mass.:29250.71
Organism:Homo sapiens (Human)
Description:P00918
Residue:260
BDBM178056
NameBDBM178056
Synonyms:1,2,4-tribromo-3-{[2-(2,5-dibromo-3,4-dimethoxyphenyl)cyclopentyl]methyl}-5,6-dimethoxybenzene (20)
TypeSmall organic molecule
Emp. Form.C22H23Br5O4
Mol. Mass.750.936
SMILESCOc1c(Br)cc(C2CCCC2Cc2c(Br)c(Br)c(OC)c(OC)c2Br)c(Br)c1OC