Reaction Details
TargetPhospholipase D
LigandBDBM50229961
Substrate/Competitorn/a
Meas. Tech.pH-Stat Assay
pH8±n/a
IC50 65±0.0 nM
Commentsextracted
Citation Djakpa, HKulkarni, ABarrows-Murphy, SMiller, GZhou, WCho, HTörök, BStieglitz, K Identifying New Drug Targets for Potent Phospholipase D Inhibitors: Combining Sequence Alignment, Molecular Docking, and Enzyme Activity/Binding Assays. Chem Biol Drug Des87:714-29 (2016) 
 
Phospholipase D
Name:Phospholipase D
Type:Protein
Mol. Mass.:59647.22
Organism:Streptomyces chromofuscus
Description:Q8KRU5
Residue:556
BDBM50229961
NameBDBM50229961
Synonyms:1-(1,1-dimethylethyl)-3-(1-naphthalenyl)-1H-pyrazolo[3,4-d]pyrimidin-4-amine 1-NA-PP1 1-tert-butyl-3-naphthalen-1-yl-1H-pyrazolo[3,4-d]pyrimidin-4-amine CHEMBL264406 US11247972, Compound 1 | US9765037, Compound 1
TypeSmall organic molecule
Emp. Form.C19H19N5
Mol. Mass.317.3877
SMILESCC(C)(C)n1nc(-c2cccc3ccccc23)c2c(N)ncnc12