Reaction Details
TargetPhospholipase D
LigandBDBM123754
Substrate/Competitorn/a
Meas. Tech.pH-Stat Assay
pH8±n/a
IC50 20±0.0 nM
Commentsextracted
Citation Djakpa, HKulkarni, ABarrows-Murphy, SMiller, GZhou, WCho, HTörök, BStieglitz, K Identifying New Drug Targets for Potent Phospholipase D Inhibitors: Combining Sequence Alignment, Molecular Docking, and Enzyme Activity/Binding Assays. Chem Biol Drug Des87:714-29 (2016) 
 
Phospholipase D
Name:Phospholipase D
Type:Protein
Mol. Mass.:59647.22
Organism:Streptomyces chromofuscus
Description:Q8KRU5
Residue:556
BDBM123754
NameBDBM123754
Synonyms:1-methyl-3-(naphthalen-1-yl)-1H-pyrazolo[3,4-d]pyrimidin-4-amine (13)
TypeSmall organic molecule
Emp. Form.C16H13N5
Mol. Mass.275.3079
SMILESCn1nc(-c2cccc3ccccc23)c2c(N)ncnc12