Reaction Details
TargetPhospholipase D
LigandBDBM123757
Substrate/Competitorn/a
Meas. Tech.pH-Stat Assay
pH8±n/a
IC50 150±0.0 nM
Commentsextracted
Citation Djakpa, HKulkarni, ABarrows-Murphy, SMiller, GZhou, WCho, HTörök, BStieglitz, K Identifying New Drug Targets for Potent Phospholipase D Inhibitors: Combining Sequence Alignment, Molecular Docking, and Enzyme Activity/Binding Assays. Chem Biol Drug Des87:714-29 (2016) 
 
Phospholipase D
Name:Phospholipase D
Type:Protein
Mol. Mass.:59647.22
Organism:Streptomyces chromofuscus
Description:Q8KRU5
Residue:556
BDBM123757
NameBDBM123757
Synonyms:1,3-dimethyl-1H-pyrazolo[3,4-d]pyrimidin-4-amine (16)
TypeSmall organic molecule
Emp. Form.C7H9N5
Mol. Mass.163.1799
SMILESCc1nn(C)c2ncnc(N)c12