Reaction Details
TargetPhospholipase D
LigandBDBM178083
Substrate/Competitorn/a
Meas. Tech.pH-Stat Assay
pH8±n/a
IC50 500±0.0 nM
Commentsextracted
Citation Djakpa, HKulkarni, ABarrows-Murphy, SMiller, GZhou, WCho, HTörök, BStieglitz, K Identifying New Drug Targets for Potent Phospholipase D Inhibitors: Combining Sequence Alignment, Molecular Docking, and Enzyme Activity/Binding Assays. Chem Biol Drug Des87:714-29 (2016) 
 
Phospholipase D
Name:Phospholipase D
Type:Protein
Mol. Mass.:59647.22
Organism:Streptomyces chromofuscus
Description:Q8KRU5
Residue:556
BDBM178083
NameBDBM178083
Synonyms:3-methyl-1H-pyrazolo[3,4-d]pyrimidin-4-amine (19)
TypeSmall organic molecule
Emp. Form.C6H7N5
Mol. Mass.149.1533
SMILESCc1n[nH]c2ncnc(N)c12